{"text_format":"1","workbook":"xlsx","n_sheets":11,"sheets":["T1","T2","T3","T4","T5","T6","Izvoz u INO","INO","pomocna","pomocna2","pomocna3"],"not_rendered":{"charts":0,"images":1,"macros":1,"external_links":2,"defined_names":45,"comments":8,"pivot_tables":0},"unopened":[],"bounds":{"document_bytes":16777216,"sheet_cells":100000,"rows_first":2000,"rows_last":500,"rows_between":2000,"halvings":0,"cell_chars":16384,"cell_head_chars":4096},"cells_cut":0,"cells_raw":0,"read":"whole","date_system":"1900"}

{"sheet":"T1","index":0,"n_rows":1,"n_cols":8,"rows_kept":1,"cut":false,"hidden":false,"merged":[]}
["Oznaka tablice","Vrsta sloga","Razdoblje poč. odgovornosti","Oznaka osobe","Ime i prezime","Broj telefona","Broj mobitela","E-adresa"]

{"sheet":"T2","index":1,"n_rows":1,"n_cols":23,"rows_kept":1,"cut":false,"hidden":false,"merged":[]}
["Oznaka tablice","Vrsta sloga","Identifikator","Razdoblje","Osnova izvješćivanja","Vrsta instrumenta","Osiguranje izvozne agencije","ISIN","Rok - izvorno dospijeće u mjesecima","Garant","Vrsta kamatne stope","Visina kamatne stope ili marže (%)","Valuta indeksacije/otplate","Valuta ugovaranja","Iznos","Način izračuna plana","Frekvencija otplate glavnice","Razdoblje prvog plaćanja glavnice","Broj rata glavnice","Frekvencija otplate kamata","Razdoblje prvog plaćanja kamate","Broj rata kamata","Ostatak vrijednosti"]

{"sheet":"T3","index":2,"n_rows":1,"n_cols":12,"rows_kept":1,"cut":false,"hidden":false,"merged":[]}
["Oznaka tablice","Vrsta sloga","Identifikator","Razdoblje","Vrsta iznosa","Korištenje","Otplata","Pretvaranje duga u vl. ulog","Oprost/ otpust duga","Otpis","Završno stanje","Indeks tržišne vrijednosti"]

{"sheet":"T4","index":3,"n_rows":1,"n_cols":5,"rows_kept":1,"cut":false,"hidden":false,"merged":[]}
["Oznaka tablice","Identifikator","Razdoblje dospijeća","Vrsta plana","Iznos"]

{"sheet":"T5","index":4,"n_rows":907,"n_cols":14,"rows_kept":907,"cut":false,"hidden":false,"merged":[]}
["Oznaka tablice","Vrsta sloga","Identifikator","Razdoblje","Država/MF nerezidenta - šifra","Sektor nerezidenta - šifra","Šifra nerezidenta","Ulagački odnos - šifra","Udio nerezidenta (%)","Država konačnoga kontrolnog vlasnika - šifra","Država nerezidenta / Međunarodna institucija","Sektor nerezidenta","Ulagački odnos","Država konačnoga kontrolnog vlasnika "]
[null,null,null,null,{"$f":"+IFERROR(VLOOKUP(K2,pomocna2!A:B,2,FALSE),\"\")","v":""},{"$f":"+IFERROR((VLOOKUP(L2,pomocna!$AC$4:$AD$20,2,FALSE)),\"\")","v":""},null,{"$f":"+IFERROR(VLOOKUP(M2,pomocna3!$F$2:$G$7,2,FALSE),\"\")","v":""},null,{"$f":"+IFERROR(VLOOKUP(N2,pomocna2!A:B,2,FALSE),\"\")","v":""}]
[null,null,null,null,{"$f":"+IFERROR(VLOOKUP(K3,pomocna2!A:B,2,FALSE),\"\")","v":""},{"$f":"+IFERROR((VLOOKUP(L3,pomocna!$AC$4:$AD$20,2,FALSE)),\"\")","v":""},null,{"$f":"+IFERROR(VLOOKUP(M3,pomocna3!$F$2:$G$7,2,FALSE),\"\")","v":""},null,{"$f":"+IFERROR(VLOOKUP(N3,pomocna2!A:B,2,FALSE),\"\")","v":""}]
[null,null,null,null,{"$f":"+IFERROR(VLOOKUP(K4,pomocna2!A:B,2,FALSE),\"\")","v":""},{"$f":"+IFERROR((VLOOKUP(L4,pomocna!$AC$4:$AD$20,2,FALSE)),\"\")","v":""},null,{"$f":"+IFERROR(VLOOKUP(M4,pomocna3!$F$2:$G$7,2,FALSE),\"\")","v":""},null,{"$f":"+IFERROR(VLOOKUP(N4,pomocna2!A:B,2,FALSE),\"\")","v":""}]
[null,null,null,null,{"$f":"+IFERROR(VLOOKUP(K5,pomocna2!A:B,2,FALSE),\"\")","v":""},{"$f":"+IFERROR((VLOOKUP(L5,pomocna!$AC$4:$AD$20,2,FALSE)),\"\")","v":""},null,{"$f":"+IFERROR(VLOOKUP(M5,pomocna3!$F$2:$G$7,2,FALSE),\"\")","v":""},null,{"$f":"+IFERROR(VLOOKUP(N5,pomocna2!A:B,2,FALSE),\"\")","v":""}]
[null,null,null,null,{"$f":"+IFERROR(VLOOKUP(K6,pomocna2!A:B,2,FALSE),\"\")","v":""},{"$f":"+IFERROR((VLOOKUP(L6,pomocna!$AC$4:$AD$20,2,FALSE)),\"\")","v":""},null,{"$f":"+IFERROR(VLOOKUP(M6,pomocna3!$F$2:$G$7,2,FALSE),\"\")","v":""},null,{"$f":"+IFERROR(VLOOKUP(N6,pomocna2!A:B,2,FALSE),\"\")","v":""}]
[null,null,null,null,{"$f":"+IFERROR(VLOOKUP(K7,pomocna2!A:B,2,FALSE),\"\")","v":""},{"$f":"+IFERROR((VLOOKUP(L7,pomocna!$AC$4:$AD$20,2,FALSE)),\"\")","v":""},null,{"$f":"+IFERROR(VLOOKUP(M7,pomocna3!$F$2:$G$7,2,FALSE),\"\")","v":""},null,{"$f":"+IFERROR(VLOOKUP(N7,pomocna2!A:B,2,FALSE),\"\")","v":""}]
[null,null,null,null,{"$f":"+IFERROR(VLOOKUP(K8,pomocna2!A:B,2,FALSE),\"\")","v":""},{"$f":"+IFERROR((VLOOKUP(L8,pomocna!$AC$4:$AD$20,2,FALSE)),\"\")","v":""},null,{"$f":"+IFERROR(VLOOKUP(M8,pomocna3!$F$2:$G$7,2,FALSE),\"\")","v":""},null,{"$f":"+IFERROR(VLOOKUP(N8,pomocna2!A:B,2,FALSE),\"\")","v":""}]
[null,null,null,null,{"$f":"+IFERROR(VLOOKUP(K9,pomocna2!A:B,2,FALSE),\"\")","v":""},{"$f":"+IFERROR((VLOOKUP(L9,pomocna!$AC$4:$AD$20,2,FALSE)),\"\")","v":""},null,{"$f":"+IFERROR(VLOOKUP(M9,pomocna3!$F$2:$G$7,2,FALSE),\"\")","v":""},null,{"$f":"+IFERROR(VLOOKUP(N9,pomocna2!A:B,2,FALSE),\"\")","v":""}]
[null,null,null,null,{"$f":"+IFERROR(VLOOKUP(K10,pomocna2!A:B,2,FALSE),\"\")","v":""},{"$f":"+IFERROR((VLOOKUP(L10,pomocna!$AC$4:$AD$20,2,FALSE)),\"\")","v":""},null,{"$f":"+IFERROR(VLOOKUP(M10,pomocna3!$F$2:$G$7,2,FALSE),\"\")","v":""},null,{"$f":"+IFERROR(VLOOKUP(N10,pomocna2!A:B,2,FALSE),\"\")","v":""}]
[null,null,null,null,{"$f":"+IFERROR(VLOOKUP(K11,pomocna2!A:B,2,FALSE),\"\")","v":""},{"$f":"+IFERROR((VLOOKUP(L11,pomocna!$AC$4:$AD$20,2,FALSE)),\"\")","v":""},null,{"$f":"+IFERROR(VLOOKUP(M11,pomocna3!$F$2:$G$7,2,FALSE),\"\")","v":""},null,{"$f":"+IFERROR(VLOOKUP(N11,pomocna2!A:B,2,FALSE),\"\")","v":""}]
[null,null,null,null,{"$f":"+IFERROR(VLOOKUP(K12,pomocna2!A:B,2,FALSE),\"\")","v":""},{"$f":"+IFERROR((VLOOKUP(L12,pomocna!$AC$4:$AD$20,2,FALSE)),\"\")","v":""},null,{"$f":"+IFERROR(VLOOKUP(M12,pomocna3!$F$2:$G$7,2,FALSE),\"\")","v":""},null,{"$f":"+IFERROR(VLOOKUP(N12,pomocna2!A:B,2,FALSE),\"\")","v":""}]
[null,null,null,null,{"$f":"+IFERROR(VLOOKUP(K13,pomocna2!A:B,2,FALSE),\"\")","v":""},{"$f":"+IFERROR((VLOOKUP(L13,pomocna!$AC$4:$AD$20,2,FALSE)),\"\")","v":""},null,{"$f":"+IFERROR(VLOOKUP(M13,pomocna3!$F$2:$G$7,2,FALSE),\"\")","v":""},null,{"$f":"+IFERROR(VLOOKUP(N13,pomocna2!A:B,2,FALSE),\"\")","v":""}]
[null,null,null,null,{"$f":"+IFERROR(VLOOKUP(K14,pomocna2!A:B,2,FALSE),\"\")","v":""},{"$f":"+IFERROR((VLOOKUP(L14,pomocna!$AC$4:$AD$20,2,FALSE)),\"\")","v":""},null,{"$f":"+IFERROR(VLOOKUP(M14,pomocna3!$F$2:$G$7,2,FALSE),\"\")","v":""},null,{"$f":"+IFERROR(VLOOKUP(N14,pomocna2!A:B,2,FALSE),\"\")","v":""}]
[null,null,null,null,{"$f":"+IFERROR(VLOOKUP(K15,pomocna2!A:B,2,FALSE),\"\")","v":""},{"$f":"+IFERROR((VLOOKUP(L15,pomocna!$AC$4:$AD$20,2,FALSE)),\"\")","v":""},null,{"$f":"+IFERROR(VLOOKUP(M15,pomocna3!$F$2:$G$7,2,FALSE),\"\")","v":""},null,{"$f":"+IFERROR(VLOOKUP(N15,pomocna2!A:B,2,FALSE),\"\")","v":""}]
[null,null,null,null,{"$f":"+IFERROR(VLOOKUP(K16,pomocna2!A:B,2,FALSE),\"\")","v":""},{"$f":"+IFERROR((VLOOKUP(L16,pomocna!$AC$4:$AD$20,2,FALSE)),\"\")","v":""},null,{"$f":"+IFERROR(VLOOKUP(M16,pomocna3!$F$2:$G$7,2,FALSE),\"\")","v":""},null,{"$f":"+IFERROR(VLOOKUP(N16,pomocna2!A:B,2,FALSE),\"\")","v":""}]
[null,null,null,null,{"$f":"+IFERROR(VLOOKUP(K17,pomocna2!A:B,2,FALSE),\"\")","v":""},{"$f":"+IFERROR((VLOOKUP(L17,pomocna!$AC$4:$AD$20,2,FALSE)),\"\")","v":""},null,{"$f":"+IFERROR(VLOOKUP(M17,pomocna3!$F$2:$G$7,2,FALSE),\"\")","v":""},null,{"$f":"+IFERROR(VLOOKUP(N17,pomocna2!A:B,2,FALSE),\"\")","v":""}]
[null,null,null,null,{"$f":"+IFERROR(VLOOKUP(K18,pomocna2!A:B,2,FALSE),\"\")","v":""},{"$f":"+IFERROR((VLOOKUP(L18,pomocna!$AC$4:$AD$20,2,FALSE)),\"\")","v":""},null,{"$f":"+IFERROR(VLOOKUP(M18,pomocna3!$F$2:$G$7,2,FALSE),\"\")","v":""},null,{"$f":"+IFERROR(VLOOKUP(N18,pomocna2!A:B,2,FALSE),\"\")","v":""}]
[null,null,null,null,{"$f":"+IFERROR(VLOOKUP(K19,pomocna2!A:B,2,FALSE),\"\")","v":""},{"$f":"+IFERROR((VLOOKUP(L19,pomocna!$AC$4:$AD$20,2,FALSE)),\"\")","v":""},null,{"$f":"+IFERROR(VLOOKUP(M19,pomocna3!$F$2:$G$7,2,FALSE),\"\")","v":""},null,{"$f":"+IFERROR(VLOOKUP(N19,pomocna2!A:B,2,FALSE),\"\")","v":""}]
[null,null,null,null,{"$f":"+IFERROR(VLOOKUP(K20,pomocna2!A:B,2,FALSE),\"\")","v":""},{"$f":"+IFERROR((VLOOKUP(L20,pomocna!$AC$4:$AD$20,2,FALSE)),\"\")","v":""},null,{"$f":"+IFERROR(VLOOKUP(M20,pomocna3!$F$2:$G$7,2,FALSE),\"\")","v":""},null,{"$f":"+IFERROR(VLOOKUP(N20,pomocna2!A:B,2,FALSE),\"\")","v":""}]
[null,null,null,null,{"$f":"+IFERROR(VLOOKUP(K21,pomocna2!A:B,2,FALSE),\"\")","v":""},{"$f":"+IFERROR((VLOOKUP(L21,pomocna!$AC$4:$AD$20,2,FALSE)),\"\")","v":""},null,{"$f":"+IFERROR(VLOOKUP(M21,pomocna3!$F$2:$G$7,2,FALSE),\"\")","v":""},null,{"$f":"+IFERROR(VLOOKUP(N21,pomocna2!A:B,2,FALSE),\"\")","v":""}]
[null,null,null,null,{"$f":"+IFERROR(VLOOKUP(K22,pomocna2!A:B,2,FALSE),\"\")","v":""},{"$f":"+IFERROR((VLOOKUP(L22,pomocna!$AC$4:$AD$20,2,FALSE)),\"\")","v":""},null,{"$f":"+IFERROR(VLOOKUP(M22,pomocna3!$F$2:$G$7,2,FALSE),\"\")","v":""},null,{"$f":"+IFERROR(VLOOKUP(N22,pomocna2!A:B,2,FALSE),\"\")","v":""}]
[null,null,null,null,{"$f":"+IFERROR(VLOOKUP(K23,pomocna2!A:B,2,FALSE),\"\")","v":""},{"$f":"+IFERROR((VLOOKUP(L23,pomocna!$AC$4:$AD$20,2,FALSE)),\"\")","v":""},null,{"$f":"+IFERROR(VLOOKUP(M23,pomocna3!$F$2:$G$7,2,FALSE),\"\")","v":""},null,{"$f":"+IFERROR(VLOOKUP(N23,pomocna2!A:B,2,FALSE),\"\")","v":""}]
[null,null,null,null,{"$f":"+IFERROR(VLOOKUP(K24,pomocna2!A:B,2,FALSE),\"\")","v":""},{"$f":"+IFERROR((VLOOKUP(L24,pomocna!$AC$4:$AD$20,2,FALSE)),\"\")","v":""},null,{"$f":"+IFERROR(VLOOKUP(M24,pomocna3!$F$2:$G$7,2,FALSE),\"\")","v":""},null,{"$f":"+IFERROR(VLOOKUP(N24,pomocna2!A:B,2,FALSE),\"\")","v":""}]
[null,null,null,null,{"$f":"+IFERROR(VLOOKUP(K25,pomocna2!A:B,2,FALSE),\"\")","v":""},{"$f":"+IFERROR((VLOOKUP(L25,pomocna!$AC$4:$AD$20,2,FALSE)),\"\")","v":""},null,{"$f":"+IFERROR(VLOOKUP(M25,pomocna3!$F$2:$G$7,2,FALSE),\"\")","v":""},null,{"$f":"+IFERROR(VLOOKUP(N25,pomocna2!A:B,2,FALSE),\"\")","v":""}]
[null,null,null,null,{"$f":"+IFERROR(VLOOKUP(K26,pomocna2!A:B,2,FALSE),\"\")","v":""},{"$f":"+IFERROR((VLOOKUP(L26,pomocna!$AC$4:$AD$20,2,FALSE)),\"\")","v":""},null,{"$f":"+IFERROR(VLOOKUP(M26,pomocna3!$F$2:$G$7,2,FALSE),\"\")","v":""},null,{"$f":"+IFERROR(VLOOKUP(N26,pomocna2!A:B,2,FALSE),\"\")","v":""}]
[null,null,null,null,{"$f":"+IFERROR(VLOOKUP(K27,pomocna2!A:B,2,FALSE),\"\")","v":""},{"$f":"+IFERROR((VLOOKUP(L27,pomocna!$AC$4:$AD$20,2,FALSE)),\"\")","v":""},null,{"$f":"+IFERROR(VLOOKUP(M27,pomocna3!$F$2:$G$7,2,FALSE),\"\")","v":""},null,{"$f":"+IFERROR(VLOOKUP(N27,pomocna2!A:B,2,FALSE),\"\")","v":""}]
[null,null,null,null,{"$f":"+IFERROR(VLOOKUP(K28,pomocna2!A:B,2,FALSE),\"\")","v":""},{"$f":"+IFERROR((VLOOKUP(L28,pomocna!$AC$4:$AD$20,2,FALSE)),\"\")","v":""},null,{"$f":"+IFERROR(VLOOKUP(M28,pomocna3!$F$2:$G$7,2,FALSE),\"\")","v":""},null,{"$f":"+IFERROR(VLOOKUP(N28,pomocna2!A:B,2,FALSE),\"\")","v":""}]
[null,null,null,null,{"$f":"+IFERROR(VLOOKUP(K29,pomocna2!A:B,2,FALSE),\"\")","v":""},{"$f":"+IFERROR((VLOOKUP(L29,pomocna!$AC$4:$AD$20,2,FALSE)),\"\")","v":""},null,{"$f":"+IFERROR(VLOOKUP(M29,pomocna3!$F$2:$G$7,2,FALSE),\"\")","v":""},null,{"$f":"+IFERROR(VLOOKUP(N29,pomocna2!A:B,2,FALSE),\"\")","v":""}]
[null,null,null,null,{"$f":"+IFERROR(VLOOKUP(K30,pomocna2!A:B,2,FALSE),\"\")","v":""},{"$f":"+IFERROR((VLOOKUP(L30,pomocna!$AC$4:$AD$20,2,FALSE)),\"\")","v":""},null,{"$f":"+IFERROR(VLOOKUP(M30,pomocna3!$F$2:$G$7,2,FALSE),\"\")","v":""},null,{"$f":"+IFERROR(VLOOKUP(N30,pomocna2!A:B,2,FALSE),\"\")","v":""}]
{"$rows_left_out":878}
{"sheet":"T6","index":5,"n_rows":1,"n_cols":11,"rows_kept":1,"cut":false,"hidden":false,"merged":[]}
["Oznaka tablice","Vrsta sloga","Identifikator","Razdoblje","CFI oznaka (kod)","Cijena izdanja","Država depozitorija","Ugrađena izvedenica (derivat)","Odnosna varijabla ugrađenog derivata","Vezana izvedenica (derivat)","Odnosna varijabla vezanog derivata"]

{"sheet":"Izvoz u INO","index":6,"n_rows":147,"n_cols":8,"rows_kept":147,"cut":false,"hidden":false,"merged":[[6,4,6,5],[8,4,8,5]]}
["UPUTA ZA DOSTAVU PODATAKA:"]
[]
["1. Omogućite izvođenje makro naredbi"]
[]
["2. Popunite tablice T1-T6 podacima"]
[]
["3. U zeleno polje upišite matični broj:",null,null,null,"1234567",null,null,"potvrdite unos tipkom <ENTER>"]
[]
["4. U plavo polje upišite redni broj slanja:",null,null,null,"01",null,null,"potvrdite unos tipkom <ENTER>"]
[]
["5. Pritisnite gumb 'Kreiraj INO datoteku' za kreiranje INO datoteke"]
[]
[]
[]
[]
[]
["Datoteka kreirana na lokaciji:"]
["K:\\270m\\ODLUKE, UPUTE I OBRASCI\\2025 izmjena Odluke\\INODUG\\1234567-202604-01-0.INO"]
[]
["6. Locirajte datoteku na navedenoj lokaciji"]
[]
["7. Provjerite matični broj (MB) i redni broj ispravnog slanja tekućeg mjeseca (NN) u nazivu datoteke"]
[]
["8. Dogovorenim načinom dostavite INO datoteku"]
[]
[]
["NAPOMENA"]
["Kod nekih MS Excel verzija je nakon omogućavanja izvođenja makro naredbi datoteku potrebno zatvoriti (da se spreme postavke) te ponovo otvoriti."]
["Do opcija za postavljanje makro naredbi dolazi se putem padajućeg izbornika u MS Excel programu:"]
["hrv. verzija >> Alati > Odrednice... > Sigurnost > Sigurnost makro naredbe... > odaberite srednja ili niska"]
{"$rows_left_out":118}
{"sheet":"INO","index":7,"n_rows":0,"n_cols":0,"rows_kept":0,"cut":false,"hidden":false,"merged":[]}

{"sheet":"pomocna","index":8,"n_rows":466,"n_cols":30,"rows_kept":466,"cut":false,"hidden":true,"merged":[]}
[]
[null,"Vrsta sloga","Oznaka osobe","Osnova izvješćivanja","Vrsta instrumenta","Osiguranje izvozne agencije","Vrsta kamatne stope","Način izračuna plana","Frekvencija otplate glavnice","Frekvencija otplate kamata","Vrsta iznosa","Vrsta plana","Sektor kreditora","Vlasnički odnos","T1","T2","T3","T4","T5","T6","Država kreditora","Valuta","Šifra kreditora","DERIVAT","VARIJABLA","Zemlja depoz"]
[null,"01","OS1","01","01","01","01","01","01","01","01","01","01","01",null,null,null,null,null,null,"AD","AED",null,"01","01","AD"]
[null,"02","OS2","02","02","02","02","02","02","02","02","02","02","02",null,null,null,null,null,null,"AE","AFN",null,"02","02","AE",null,"01 Nefinancijska društva","Nefinancijska društva",{"$f":"+LEFT(AB4,2)","v":"01"}]
[null,null,null,null,"03",null,"03","03","03","03","03",null,"03","03",null,null,null,null,null,null,"AF","ALL",null,null,"03","AF",null,"02 Središnja banka","Središnja banka",{"$f":"+LEFT(AB5,2)","v":"02"}]
[null,null,null,null,"04",null,"04","04","04","04","04",null,"23","04",null,null,null,null,null,null,"AG","AMD",null,null,"04","AG",null,"03 Društva koja primaju depozite (banke) osim središnje banke (za banke s područja EU potrebno unijeti i šifru nerezidenta,  iz dokumenta \"Odnosi s inozemstvom- prilozi i popisi\"i)","Banke tj. društva koja primaju depozite osim središnje banke","03"]
[null,null,null,null,"05",null,"97",null,"05","05","05",null,"04","05",null,null,null,null,null,null,"AI","ANG",null,null,"05","AI",null,"23 Novčani fondovi (za NF s područja EU potrebno unijeti i šifru nerezidenta,  iz dokumenta \"Odnosi s inozemstvom- prilozi i popisi\".)","Novčani fondovi","23"]
[null,null,null,null,"06",null,"98",null,null,null,"06",null,"24","06",null,null,null,null,null,null,"AL","AOA",null,null,"06","AL",null,"04 Ostali financijski posrednici, osim društava za osiguranje i mirovinskih fondova","Ostali financijski posrednici, osim društava za osiguranje i mirovinskih fondova","04"]
[null,null,null,null,"07",null,"99",null,null,null,"07",null,"05",null,null,null,null,null,null,null,"AM","ARS",null,null,"07","AM",null,"24 Nenovčani investicijski fondovi","Nenovčani investicijski fondovi","24"]
[null,null,null,null,"08",null,null,null,null,null,"08",null,"06",null,null,null,null,null,null,null,"AO","AUD",null,null,"08","AO",null,"05 Financijske pomoćne institucije ","Financijske pomoćne institucije ","05"]
[null,null,null,null,"09",null,null,null,null,null,"09",null,"16",null,null,null,null,null,null,null,"AQ","AWG",null,null,"09","AQ",null,"06 Osiguravajuća društva ","Osiguravajuća društva ","06"]
[null,null,null,null,"10",null,null,null,null,null,null,null,"07",null,null,null,null,null,null,null,"AR","AZM",null,null,"10","AR",null,"16 Mirovinski fondovi","Mirovinski fondovi","16"]
[null,null,null,null,"11",null,null,null,null,null,null,null,"08",null,null,null,null,null,null,null,"AS","AZN",null,null,"99","AS",null,"07 Središnja država","Središnja država","07"]
[null,null,null,null,"12",null,null,null,null,null,null,null,"09",null,null,null,null,null,null,null,"AT","BAM",null,null,null,"AT",null,"08 Savezna država","Savezna država","08"]
[null,null,null,null,"13",null,null,null,null,null,null,null,"10",null,null,null,null,null,null,null,"AU","BBD",null,null,null,"AU",null,"09 Lokalna država","Lokalna država","09"]
[null,null,null,null,"99",null,null,null,null,null,null,null,"11",null,null,null,null,null,null,null,"AW","BDT",null,null,null,"AW",null,"10 Fondovi socijalne sigurnosti","Fondovi socijalne sigurnosti","10"]
[null,null,null,null,null,null,null,null,null,null,null,null,"12",null,null,null,null,null,null,null,"AX","BGN",null,null,null,"AX",null,"11 Kućanstva","Kućanstva","11"]
[null,null,null,null,null,null,null,null,null,null,null,null,"13",null,null,null,null,null,null,null,"AZ","BHD",null,null,null,"AZ",null,"12 Neprofitne institucije koje služe stanovništvu","Neprofitne institucije koje služe stanovništvu","12"]
[null,null,null,null,null,null,null,null,null,null,null,null,99,null,null,null,null,null,null,null,"BA","BIF",null,null,null,"BA",null,"13 Međunarodne institucije (potrebno unijeti i šifru nerezidenta, a istu šifru upisati i kao državu nerezidenta, iz dokumenta \"Odnosi s inozemstvom- prilozi i popisi\".)","Međunarodne institucije","13"]
[null,null,null,null,null,null,null,null,null,null,null,null,null,null,null,null,null,null,null,null,"BB","BMD",null,null,null,"BB",null,"99 Rezident (samo ako hrvatska banka sudjeluje u međ.sindikatu banaka koji odobrava kredit, potrebno unijeti i šifru, iz dokumenta \"Odnosi s inozemstvom- prilozi i popisi\".)","Rezident (samo ako hrvatska banka sudjeluje u međ.sindikatu banaka)","99"]
[null,null,null,null,null,null,null,null,null,null,null,null,null,null,null,null,null,null,null,null,"BD","BND",null,null,null,"BD"]
[null,null,null,null,null,null,null,null,null,null,null,null,null,null,null,null,null,null,null,null,"BE","BRL",null,null,null,"BE"]
[null,null,null,null,null,null,null,null,null,null,null,null,null,null,null,null,null,null,null,null,"BF","BSD",null,null,null,"BF"]
[null,null,null,null,null,null,null,null,null,null,null,null,null,null,null,null,null,null,null,null,"BG","BTN",null,null,null,"BG"]
[null,null,null,null,null,null,null,null,null,null,null,null,null,null,null,null,null,null,null,null,"BH","BWP",null,null,null,"BH"]
[null,null,null,null,null,null,null,null,null,null,null,null,null,null,null,null,null,null,null,null,"BI","BYN",null,null,null,"BI"]
[null,null,null,null,null,null,null,null,null,null,null,null,null,null,null,null,null,null,null,null,"BJ","BZD",null,null,null,"BJ"]
[null,null,null,null,null,null,null,null,null,null,null,null,null,null,null,null,null,null,null,null,"BL","CAD",null,null,null,"BL"]
[null,null,null,null,null,null,null,null,null,null,null,null,null,null,null,null,null,null,null,null,"BM","CDF",null,null,null,"BM"]
[null,null,null,null,null,null,null,null,null,null,null,null,null,null,null,null,null,null,null,null,"BN","CHE",null,null,null,"BN"]
{"$rows_left_out":437}
{"sheet":"pomocna2","index":9,"n_rows":465,"n_cols":2,"rows_kept":465,"cut":false,"hidden":true,"merged":[]}
["NAZIV_HR","SIFRASLOV2"]
["AFGANISTAN","AF"]
["ALBANIJA","AL"]
["ALŽIR","DZ"]
["AMERIČKA SAMOA","AS"]
["ANDORA","AD"]
["ANGOLA","AO"]
["ANGUILLA","AI"]
["ANTARKTIKA","AQ"]
["ANTIGVA I BARBUDA","AG"]
["ARGENTINA","AR"]
["ARMENIJA","AM"]
["ARUBA","AW"]
["AUSTRALIJA","AU"]
["AUSTRIJA","AT"]
["AZERBAJDŽAN","AZ"]
["BAHAMI","BS"]
["BAHREIN","BH"]
["BANGLADEŠ","BD"]
["BARBADOS","BB"]
["BELGIJA","BE"]
["BELIZE","BZ"]
["BENIN","BJ"]
["BERMUDI","BM"]
["BJELOKOSNA OBALA","CI"]
["BJELORUSIJA","BY"]
["BOCVANA","BW"]
["BOLIVIJA (PLURINACIONALNA DRŽAVA)","BO"]
["BONAIRE, SVETI EUSTAZIJE I SABA","BQ"]
["BOSNA I HERCEGOVINA","BA"]
{"$rows_left_out":436}
{"sheet":"pomocna3","index":10,"n_rows":182,"n_cols":7,"rows_kept":182,"cut":false,"hidden":true,"merged":[]}
["NAZIV_HR","SIFRASLOV2"]
["UAE DIRHAM","AED",null,null,"01 - Rezident je izravni ulagač u nerezidenta (ima vlasnički udjel u nerezidentu od 10% ili više)",{"$f":"+MID(E2,6,100)","v":"Rezident je izravni ulagač u nerezidenta (ima vlasnički udjel u nerezidentu od 10% ili više)"},{"$f":"+LEFT(E2,2)","v":"01"}]
["AFGAN","AFN",null,null,"02 - Nerezident je izravni ulagač u rezidenta ( ima vlasnički udjel u rezidentu od 10% ili više)",{"$f":"+MID(E3,6,100)","v":"Nerezident je izravni ulagač u rezidenta ( ima vlasnički udjel u rezidentu od 10% ili više)"},{"$f":"+LEFT(E3,2)","v":"02"}]
["LEK","ALL",null,null,"03 - Rezident je posredni izravni ulagač u nerezidenta","Rezident je posredni izravni ulagač u nerezidenta","03"]
["ARMENSKI DRAM","AMD",null,null,"04 - Nerezident je posredni izravni ulagač u rezidenta","Nerezident je posredni izravni ulagač u rezidenta","04"]
["NIZOZEMSKOANTILSKI GULDEN","ANG",null,null,"06 - Horizontalno povezana poduzeća",{"$f":"+MID(E6,6,100)","v":"Horizontalno povezana poduzeća"},{"$f":"+LEFT(E6,2)","v":"06"}]
["KVANZA","AOA",null,null,"05 - Ne postoji vlasnička povezanost",{"$f":"+MID(E7,6,100)","v":"Ne postoji vlasnička povezanost"},{"$f":"+LEFT(E7,2)","v":"05"}]
["ARGENTINSKI PEZO","ARS"]
["AUSTRALSKI DOLAR","AUD"]
["ARUPSKI FLORIN","AWG"]
["NOVI AZERBAJDZANSKI MANAT","AZM"]
["AZERBAJDZANSKI MANAT","AZN"]
["KONVERTIBILNA MARKA","BAM"]
["BARBADOSKI DOLAR","BBD"]
["TAKA","BDT"]
["BUGARSKI LEV","BGN"]
["BAHREINSKI DINAR","BHD"]
["BURUNDSKI FRANAK","BIF"]
["BERMUDSKI DOLAR","BMD"]
["BRUNEJSKI DOLAR","BND"]
["BRAZILSKI REAL","BRL"]
["BAHAMSKI DOLAR","BSD"]
["NGULTRUM","BTN"]
["PULA","BWP"]
["BJELORUSKI RUBALJ","BYN"]
["BELIZEANSKI DOLAR","BZD"]
["KANADSKI DOLAR","CAD"]
["KONGOANSKI FRANAK","CDF"]
["WIR EURO","CHE"]
["SVICARSKI FRANAK","CHF"]
{"$rows_left_out":152}