{"text_format":"1","workbook":"xlsx","n_sheets":23,"sheets":["zemlje","Sifrarnici","šifrarnik za identifikatore","šifrarnik zemalja i NKD","šifrarnik identifikatora","Tablica 1. Osoba za kontakt","Šifrarnik A.","Šifrarnik K.","Šifrarnik D.","Tablica A.1.IZRAVNA ULAGANJA","Tablica A.1.OSTALA ULAGANJA","Tablica A.2.","Tablica A.4.","Tablica A.5.","Napomena","Šifrarnik B.","Šifrarnik B.B.","Tablica B.1.IZRAVNA ULAGANJA","Tablica B.1.OSTALA ULAGANJA","B.2.1.Transakcije-izravna","B.2.2.Transakcije-ostala","Tablica Dodatak A","Kreiranje datoteke"],"not_rendered":{"charts":0,"images":2,"macros":1,"external_links":1,"defined_names":74,"comments":6,"pivot_tables":0},"unopened":[],"bounds":{"document_bytes":16777216,"sheet_cells":100000,"rows_first":2000,"rows_last":500,"rows_between":2000,"halvings":0,"cell_chars":16384,"cell_head_chars":4096},"cells_cut":0,"cells_raw":0,"read":"whole","date_system":"1900"}

{"sheet":"zemlje","index":0,"n_rows":325,"n_cols":4,"rows_kept":325,"cut":false,"hidden":true,"merged":[]}
["AD",null,null,{"$f":"CONCATENATE(\"O-\",A1)","v":"O-AD"}]
["AE",null,null,"O-AE"]
["AF",null,null,"O-AF"]
["AG",null,null,"O-AG"]
["AI",null,null,"O-AI"]
["AL",null,null,"O-AL"]
["AM",null,null,"O-AM"]
["AO",null,null,"O-AO"]
["AQ",null,null,"O-AQ"]
["AR",null,null,"O-AR"]
{"$rows_left_out":316}
{"sheet":"Sifrarnici","index":1,"n_rows":687,"n_cols":37,"rows_kept":687,"cut":false,"hidden":true,"merged":[]}
[null,null,null,null,null,null,null,null,null,null,"OS1","202601",1,"uplata u novcu",{"$f":"CONCATENATE(M1, \" - \",N1)","v":"1 - uplata u novcu"},null,null,null,null,null,"B001",null,1,1,"Q1",null,"Uzgoj žitarica, osim riže, uzgoj mahunarki i uljanog sjemenja","01110","01.11.0 - Uzgoj žitarica, osim riže, uzgoj mahunarki i uljanog sjemenja",null,null,null,null,null,null,null,"DA"]
[null,null,null,null,null,null,null,null,null,null,"OS2","202602",2,"maržni kredit brokera",{"$f":"CONCATENATE(M2, \" - \",N2)","v":"2 - maržni kredit brokera"},null,null,null,null,null,"B002",null,3,2,"Q2",null,"Uzgoj riže","01120","01.12.0 - Uzgoj riže",null,null,null,null,null,null,null,"NE"]
[null,null,null,null,null,null,null,null,null,null,null,"202603",3,"stvari","3 - stvari",null,null,null,null,null,"B003",null,4,3,"Q3",null,"Uzgoj povrća, dinja i lubenica, korjenastog i gomoljastog povrća","01130","01.13.0 - Uzgoj povrća, dinja i lubenica, korjenastog i gomoljastog povrća"]
[null,null,null,null,null,null,null,null,null,null,null,"202604",4,"prava i licence","4 - prava i licence",null,null,null,null,null,"B004",null,null,4,"Q4",null,"Uzgoj šećerne trske","01140","01.14.0 - Uzgoj šećerne trske"]
[null,null,null,null,null,null,null,null,null,null,null,"202605",5,"zamjena dužničkog odnosa vlasničkim","5 - zamjena dužničkog odnosa vlasničkim",null,null,null,null,null,"B005",null,null,5,null,null,"Uzgoj duhana","01150","01.15.0 - Uzgoj duhana"]
[null,null,null,null,null,null,null,null,null,null,null,"202606",7,"fin.potraživanja / imovina (osim dionica/vl.udjela)","7 - fin.potraživanja / imovina (osim dionica/vl.udjela)",null,null,null,null,null,"B006",null,null,6,null,null,"Uzgoj predivog bilja","01160","01.16.0 - Uzgoj predivog bilja"]
[null,null,null,null,null,null,null,null,null,null,null,"202607","7a","fin. imovina u obliku dionica/vl.udjela rezidentnog društva","7a - fin. imovina u obliku dionica/vl.udjela rezidentnog društva",null,null,null,null,null,"B007",null,null,7,null,null,"Uzgoj ostalih jednogodišnjih usjeva","01190","01.19.0 - Uzgoj ostalih jednogodišnjih usjeva"]
[null,null,null,null,null,null,null,null,null,null,null,"202608","7b","fin. imovina u obliku dionica/vl.udjela nerezidentnog društva ","7b - fin. imovina u obliku dionica/vl.udjela nerezidentnog društva ",null,null,null,null,null,"B008",null,null,8,null,null,"Uzgoj grožđa","01210","01.21.0 - Uzgoj grožđa"]
[null,null,null,null,null,null,null,null,null,null,null,"202609","7c","vl. udjeli (dionice) stečene kroz dividendu u dionicama ","7c - vl. udjeli (dionice) stečene kroz dividendu u dionicama ",null,null,null,null,null,"B009",null,null,9,null,null,"Uzgoj tropskog i suptropskog voća","01220","01.22.0 - Uzgoj tropskog i suptropskog voća"]
[null,null,null,null,null,null,null,null,null,null,null,"202610",8,"pripajanja i spajanja",{"$f":"CONCATENATE(M10, \" - \",N10)","v":"8 - pripajanja i spajanja"},null,null,null,null,null,"B010",null,null,10,null,null,"Uzgoj agruma","01230","01.23.0 - Uzgoj agruma"]
{"$rows_left_out":678}
{"sheet":"šifrarnik za identifikatore","index":2,"n_rows":361,"n_cols":9,"rows_kept":361,"cut":false,"hidden":true,"merged":[]}
["DVOSLOVNA OZNAKA","dvoslovna dio","identifikator","ostalo",null,null,"šif a","šif b","šif bb"]
["AD","AR","VAT broj","VAT broj",null,{"$f":"IF(COUNTIF(dio, A2) > 0, \"identifikator\",\"ostalo\")","v":"ostalo"},{"$f":"INDEX('šifrarnik za identifikatore'!$F$2:$F$326, MATCH('Šifrarnik A.'!#REF!,dvoslovna, 0))","v":{"$error":"#REF!"}},{"$f":"INDEX('šifrarnik za identifikatore'!$F$2:$F$326, MATCH('Šifrarnik B.'!C4,dvoslovna, 0))","v":{"$error":"#N/A"}},{"$f":"INDEX('šifrarnik za identifikatore'!$F$2:$F$326, MATCH('Šifrarnik B.B.'!G3,dvoslovna, 0))","v":{"$error":"#N/A"}}]
["AE","AE","Porezni broj","Porezni broj",null,{"$f":"IF(COUNTIF(dio, A3) > 0, \"identifikator\",\"ostalo\")","v":"identifikator"},{"$f":"INDEX('šifrarnik za identifikatore'!$F$2:$F$326, MATCH('Šifrarnik A.'!#REF!,dvoslovna, 0))","v":{"$error":"#REF!"}},{"$f":"INDEX('šifrarnik za identifikatore'!$F$2:$F$326, MATCH('Šifrarnik B.'!C5,dvoslovna, 0))","v":{"$error":"#N/A"}},{"$f":"INDEX('šifrarnik za identifikatore'!$F$2:$F$326, MATCH('Šifrarnik B.B.'!G4,dvoslovna, 0))","v":{"$error":"#N/A"}}]
["AF","AT","Broj iz poslovnog registra","Broj iz poslovnog registra",null,{"$f":"IF(COUNTIF(dio, A4) > 0, \"identifikator\",\"ostalo\")","v":"ostalo"},{"$f":"INDEX('šifrarnik za identifikatore'!$F$2:$F$326, MATCH('Šifrarnik A.'!#REF!,dvoslovna, 0))","v":{"$error":"#REF!"}},{"$f":"INDEX('šifrarnik za identifikatore'!$F$2:$F$326, MATCH('Šifrarnik B.'!C6,dvoslovna, 0))","v":{"$error":"#N/A"}},{"$f":"INDEX('šifrarnik za identifikatore'!$F$2:$F$326, MATCH('Šifrarnik B.B.'!G5,dvoslovna, 0))","v":{"$error":"#N/A"}}]
["AG","AU",null,"Ostalo",null,"ostalo",{"$f":"INDEX('šifrarnik za identifikatore'!$F$2:$F$326, MATCH('Šifrarnik A.'!C4,dvoslovna, 0))","v":{"$error":"#N/A"}},{"$f":"INDEX('šifrarnik za identifikatore'!$F$2:$F$326, MATCH('Šifrarnik B.'!C7,dvoslovna, 0))","v":{"$error":"#N/A"}},{"$f":"INDEX('šifrarnik za identifikatore'!$F$2:$F$326, MATCH('Šifrarnik B.B.'!G6,dvoslovna, 0))","v":{"$error":"#N/A"}}]
["AI","BA",null,null,null,"ostalo",{"$f":"INDEX('šifrarnik za identifikatore'!$F$2:$F$326, MATCH('Šifrarnik A.'!C5,dvoslovna, 0))","v":{"$error":"#N/A"}},{"$f":"INDEX('šifrarnik za identifikatore'!$F$2:$F$326, MATCH('Šifrarnik B.'!C8,dvoslovna, 0))","v":{"$error":"#N/A"}},{"$f":"INDEX('šifrarnik za identifikatore'!$F$2:$F$326, MATCH('Šifrarnik B.B.'!G7,dvoslovna, 0))","v":{"$error":"#N/A"}}]
["AL","BE",null,null,null,"ostalo",{"$f":"INDEX('šifrarnik za identifikatore'!$F$2:$F$326, MATCH('Šifrarnik A.'!C6,dvoslovna, 0))","v":{"$error":"#N/A"}},{"$f":"INDEX('šifrarnik za identifikatore'!$F$2:$F$326, MATCH('Šifrarnik B.'!C9,dvoslovna, 0))","v":{"$error":"#N/A"}},{"$f":"INDEX('šifrarnik za identifikatore'!$F$2:$F$326, MATCH('Šifrarnik B.B.'!G8,dvoslovna, 0))","v":{"$error":"#N/A"}}]
["AM","BG",null,null,null,"ostalo",{"$f":"INDEX('šifrarnik za identifikatore'!$F$2:$F$326, MATCH('Šifrarnik A.'!C7,dvoslovna, 0))","v":{"$error":"#N/A"}},{"$f":"INDEX('šifrarnik za identifikatore'!$F$2:$F$326, MATCH('Šifrarnik B.'!C10,dvoslovna, 0))","v":{"$error":"#N/A"}},{"$f":"INDEX('šifrarnik za identifikatore'!$F$2:$F$326, MATCH('Šifrarnik B.B.'!G9,dvoslovna, 0))","v":{"$error":"#N/A"}}]
["AN","BH",null,null,null,"ostalo",{"$f":"INDEX('šifrarnik za identifikatore'!$F$2:$F$326, MATCH('Šifrarnik A.'!C8,dvoslovna, 0))","v":{"$error":"#N/A"}},{"$f":"INDEX('šifrarnik za identifikatore'!$F$2:$F$326, MATCH('Šifrarnik B.'!C11,dvoslovna, 0))","v":{"$error":"#N/A"}},{"$f":"INDEX('šifrarnik za identifikatore'!$F$2:$F$326, MATCH('Šifrarnik B.B.'!G10,dvoslovna, 0))","v":{"$error":"#N/A"}}]
["AO","BM",null,null,null,"ostalo",{"$f":"INDEX('šifrarnik za identifikatore'!$F$2:$F$326, MATCH('Šifrarnik A.'!C9,dvoslovna, 0))","v":{"$error":"#N/A"}},{"$f":"INDEX('šifrarnik za identifikatore'!$F$2:$F$326, MATCH('Šifrarnik B.'!C12,dvoslovna, 0))","v":{"$error":"#N/A"}},{"$f":"INDEX('šifrarnik za identifikatore'!$F$2:$F$326, MATCH('Šifrarnik B.B.'!G11,dvoslovna, 0))","v":{"$error":"#N/A"}}]
{"$rows_left_out":352}
{"sheet":"šifrarnik zemalja i NKD","index":3,"n_rows":687,"n_cols":11,"rows_kept":687,"cut":false,"hidden":false,"merged":[]}
["DVOSLOVNA OZNAKA","DVOSLOVNA OZNAKA"," DRŽAVA ILI ZEMLJA (kratko ime na hrvatskom)",null,null,"DVOSLOVNA OZNAKA","ENGLESKI NAZIV FINANCIJSKE INSTITUCIJE",null,null,null,"NACE Rev.2.1 / NKD 2025"]
["AF","AF","AFGANISTAN",null,null,"5U","ADC (Andean Development Corporation)",null,null,null,"01.11.0 - Uzgoj žitarica, osim riže, uzgoj mahunarki i uljanog sjemenja"]
["AL","AL","ALBANIJA",null,null,"5D","AfDB (African Development Bank)",null,null,null,"01.12.0 - Uzgoj riže"]
["DZ","DZ","ALŽIR",null,null,"5Q","African Development Fund",null,null,null,"01.13.0 - Uzgoj povrća, dinja i lubenica, korjenastog i gomoljastog povrća"]
["AS","AS","AMERIČKA SAMOA",null,null,"5M","AMF (Arab Monetary Fund)",null,null,null,"01.14.0 - Uzgoj šećerne trske"]
["VI","VI","AMERIČKI DJEVIČANSKI OTOCI",null,null,"5E","AsDB (Asian Development Bank)",null,null,null,"01.15.0 - Uzgoj duhana"]
["AD","AD","ANDORA",null,null,"5R","Asian Development Fund",null,null,null,"01.16.0 - Uzgoj predivog bilja"]
["AO","AO","ANGOLA",null,null,"5N","BADEA (Banque arabe pour le développement économique en Afrique)",null,null,null,"01.19.0 - Uzgoj ostalih jednogodišnjih usjeva"]
["AI","AI","ANGUILLA",null,null,"5O","Banque Centrale des États de l’Afrique de l’Ouest (BCEAO)",null,null,null,"01.21.0 - Uzgoj grožđa"]
["AQ","AQ","ANTARKTIKA",null,null,"5W","Banque des États de l’Afrique centrale (BEAC)",null,null,null,"01.22.0 - Uzgoj tropskog i suptropskog voća"]
{"$rows_left_out":678}
{"sheet":"šifrarnik identifikatora","index":4,"n_rows":124,"n_cols":7,"rows_kept":124,"cut":false,"hidden":false,"merged":[]}
["DVOSLOVNA OZNAKA"," DRŽAVA ILI ZEMLJA (kratko ime na hrvatskom)","VRSTA IDENTIFIKATORA","OPIS FORMATA ZA IZVJEŠTAVANJE","FORMAT IZVJEŠTAVANJA",null,"VRSTA IDENTIFIKATORA"]
["AR","ARGENTINA","Porezni broj","11-znamenkasti broj u formatu NN-NNNNNNNN-N (prve 2 znamenke označuju tip osobe; ID/DNI/CUIT).","30-71024269-7",null,"VAT broj"]
["AU","AUSTRALIJA","Broj iz poslovnog registra","2 znamenke + \" \" + 3 znamenke + \" \" + 3 znamenke + \" \" + 3 znamenke","34 072 814 058",null,"Porezni broj"]
["AU","AUSTRALIJA","Broj iz poslovnog registra","3 znamenke + \" \" + 3 znamenke + \" \" + 3 znamenke","150 217 299",null,"Broj iz poslovnog registra"]
["AT","AUSTRIJA","Broj iz poslovnog registra","do 7 znakova; zadnji znak je slovo (nije osjetljivo na velika/mala slova)","79063w \n"]
["BS","BAHAMI","Broj iz poslovnog registra","Broj od 5 do 7 znamenki","85844, 8046725"]
["BH","BAHREIN","Broj iz poslovnog registra","5 znamenki + \"-\" + 1 znamenka"," 49171-1"]
["GG","GUERNSEY","Broj iz poslovnog registra","Broj s najviše 6 znamenki",56753]
["BY","BJELORUSIJA","Broj iz poslovnog registra","9-znamenkasti broj",191262660]
["BE","BELGIJA","Broj iz poslovnog registra","10-znamenkasti broj, uvijek počinje s 0 ili 1 (posljednje dvije znamenke su kontrolni broj)","0203201340, 1203201340"]
{"$rows_left_out":115}
{"sheet":"Tablica 1. Osoba za kontakt","index":5,"n_rows":2,"n_cols":5,"rows_kept":2,"cut":false,"hidden":false,"merged":[]}
["Oznaka osobe","Ime i prezime","Broj telefona","Broj telefaksa","E-mail adresa"]
["<OdgovornaOsoba>","<ImeIPrezime>","<Telefon>","<Telefaks>","<EMail>"]

{"sheet":"Šifrarnik A.","index":6,"n_rows":3,"n_cols":9,"rows_kept":3,"cut":false,"hidden":false,"merged":[[0,8,1,8],[0,0,0,1],[0,2,1,2],[0,3,1,3],[0,6,1,6],[0,7,1,7],[0,5,1,5],[0,4,1,4]]}
["Šifra inozemnog ulagača",null,"Zemlja inozemnog ulagača*","Postotak udjela u kapitalu* (%)","Vrsta identifikatora inozemnog ulagača","Identifikator inozemnog ulagača","Naziv i sjedište inozemnog ulagača","Djelatnost inozemnog ulagača","Način ulaska u vlasničku strukturu"]
["Vrsta inozemnog ulaganja*","Broj inozemnog ulagača                (ne upisuje se za ostale ulagače!)"]
["<SifraInozemnogUlagaca>","<BrojInoUlagaca>","<ZemljaInozemnogVlasnika>","<PostotakUdjelaUVlasnistvu>",null,null,"<NazivISjedisteInozemnogVlasnika>","<DjelatnostInozemnogVlasnika>","<NacinUlaskaUVlasnickuStrukturu>"]

{"sheet":"Šifrarnik K.","index":7,"n_rows":3,"n_cols":3,"rows_kept":3,"cut":false,"hidden":false,"merged":[[0,2,1,2],[0,0,1,0],[0,1,1,1]]}
["Zemlja konačnog kontrolnog vlasnika","Naziv i sjedište konačnog kontrolnog vlasnika","Djelatnost konačnog kontrolnog vlasnika"]
[]
["<ZemljaInozemnogVlasnika>","<NazivISjedisteInozemnogVlasnika>","<DjelatnostInozemnogVlasnika>"]

{"sheet":"Šifrarnik D.","index":8,"n_rows":2,"n_cols":3,"rows_kept":2,"cut":false,"hidden":false,"merged":[]}
["OIB"," Naziv i sjedište domaće pravne osobe ","Postotak udjela u kapitalu (%)            jednak ili veći od 50%"]
["<OIB>","<NazivISjedisteDomacegVlasnika>","<PostotakUdjelaUVlasnistvu>"]

{"sheet":"Tablica A.1.IZRAVNA ULAGANJA","index":9,"n_rows":3,"n_cols":7,"rows_kept":3,"cut":false,"hidden":false,"merged":[[0,5,1,5],[0,6,1,6],[0,0,0,1],[0,2,1,2],[0,3,1,3],[0,4,1,4]]}
["Šifra inozemnog ulagača             ",null,"Mjesec","Tržišna vrijednost dionica ili udjela u kapitalu               (u tisućama eura)","Vrsta vlasničkog ulaganja","Način plaćanja","Udio u temeljnom kapitalu               ostvaren transakcijom ( %)"]
["Vrsta inozemnog ulaganja","Broj inozemnog ulagača"]
["<SifraInozemnogUlagaca>","<BrojInoUlagaca>","<Mjesec>","<TrzisnaVrijednostDionicaIliUdjelaUKapitalu>","<VrstaVlasnickogUlaganja>","<NacinPlacanja>","<UdioUTemeljnomKapitalu>"]

{"sheet":"Tablica A.1.OSTALA ULAGANJA","index":10,"n_rows":3,"n_cols":5,"rows_kept":3,"cut":false,"hidden":false,"merged":[[0,0,0,1],[0,2,1,2],[0,3,1,3],[0,4,1,4]]}
["Šifra inozemnog ulagača - ostali ulagači (<10%)",null,"Mjesec","Tržišna vrijednost udjela u kapitalu                       (u tisućama eura)","Način plaćanja"]
["Vrsta inozemnog ulaganja","Zemlja inozemnog ulagača"]
["<SIFRAINOZEMNOGULAGACA>","<ZemljaInozemnogVlasnika>","<Mjesec>","<TrzisnaVrijednostDionicaIliUdjelaUKapitalu>","<NacinPlacanja>"]

{"sheet":"Tablica A.2.","index":11,"n_rows":11,"n_cols":1,"rows_kept":11,"cut":false,"hidden":false,"merged":[]}
["90) UPISANI TEMELJNI KAPITAL bez premija na emitirane dionice"]
["      901) od toga, UPISANI TEMELJNI KAPITAL KOJI NIJE PLAĆEN"]
["91) PREMIJE NA EMITIRANE DIONICE"]
["92) REVALORIZACIJSKE PRIČUVE"]
["93) PRIČUVE (ZAKONSKE, STATUTARNE i OSTALE)"]
["94) ZADRŽANI DOBICI ILI PRENESENI GUBITAK"]
["95) NETO DOBIT (GUBITAK) TEKUĆE POSLOVNE GODINE"]
["   95a) Dobit ili gubitak tekuće poslovne godine koji je posljedica vrijednosnih usklađivanja (Vidi upute!)"]
["*OSTVARENA NETO DOBIT (GUBITAK) SAMO ZA IZVJEŠTAJNO RAZDOBLJE"]
["9) UKUPNI KAPITAL (suma 90 - 95)"]
{"$rows_left_out":2}
{"sheet":"Tablica A.4.","index":12,"n_rows":5,"n_cols":1,"rows_kept":5,"cut":false,"hidden":false,"merged":[]}
["1. Mjesec stjecanja prava na dividendu"]
["2. Dobit (gubitak) prije oporezivanja                               "]
[" 2.a. Dobit (gubitak) prije oporezivanja kao posljedica vrijednosnih usklađivanja ( Vidi upute!) "]
["3. Dobit (gubitak) nakon oporezivanja"]
["4. Za raspodijeliti svim članovima (vlasnicima)     "]

{"sheet":"Tablica A.5.","index":13,"n_rows":2,"n_cols":4,"rows_kept":2,"cut":false,"hidden":false,"merged":[]}
["Šifra inozemnog ulagača iz Šifrarnika A","Mjesec","Isplaćena dividenda   /   udio u dobiti                                          (u tisućama eura)","Isplaćena zadržana dobit prethodnih godina                           (u tisućama eura)"]
["<SifraInozemnogUlagaca>","<Mjesec>","<IsplacenaDividendaUdioUDobiti>","<IsplacenaZadrzanaDobitPrethodnihGodina>"]

{"sheet":"Napomena","index":14,"n_rows":1,"n_cols":1,"rows_kept":1,"cut":false,"hidden":false,"merged":[[0,0,6,0],[0,1,6,1]]}
["Napomena                        upisati u jednom odlomku, bez tipe \"ENTER\""]

{"sheet":"Šifrarnik B.","index":15,"n_rows":3,"n_cols":8,"rows_kept":3,"cut":false,"hidden":false,"merged":[[0,0,0,1],[0,2,1,2],[0,3,1,3],[0,6,1,6],[0,7,1,7],[0,5,1,5],[0,4,1,4]]}
["Šifra inozemne pravne osobe",null,"Zemlja inozemne pravne osobe*","Postotak udjela u kapitalu* (%)","Vrsta identifikatora inozemne pravne osobe","Identifikator inozemne pravne osobe","Naziv i sjedište inozemne pravne osobe","Djelatnost inozemne pravne osobe"]
["Vrsta inozemnog ulaganja*","Broj inozemne pravne osobe              "]
["<VrstaInozemnogUlaganja>","<BrojInozemnePravneOsobe>","<ZemljaInozemnogVlasnika>","<PostotakUdjelaUVlasnistvu>",null,null,"<NazivISjedisteInozemnogVlasnika>","<DjelatnostInozemnogVlasnika>"]

{"sheet":"Šifrarnik B.B.","index":16,"n_rows":2,"n_cols":11,"rows_kept":2,"cut":false,"hidden":false,"merged":[]}
["Šifra inozemne pravne osobe","Razina1","Razina2","Razina3","Razina4","Razina5","Zemlja inozemne pravne osobe","Vrsta identifikatora inozemne pravne osobe","Identifikator inozemne pravne osobe","Naziv i sjedište inozemne pravne osobe","Postotak udjela u kapitalu (%)"]
["<SifraInozemnePravneOsobe>","<Nivo1>","<Nivo2>","<Nivo3>","<Nivo4>","<Nivo5>","<ZemljaInozemnePravneOsobe>",null,null,"<NazivISjedisteInozemnePravneOsobe>","<PostotakUdjelaUKapitalu>"]

{"sheet":"Tablica B.1.IZRAVNA ULAGANJA","index":17,"n_rows":5,"n_cols":18,"rows_kept":5,"cut":false,"hidden":false,"merged":[[2,10,3,10],[2,8,3,8],[1,17,3,17],[1,16,3,16],[0,0,0,1],[1,15,3,15],[1,2,3,2],[1,3,3,3],[1,0,2,1],[2,4,3,4],[2,5,3,5],[2,6,3,6],[2,7,3,7],[1,12,3,12],[1,13,3,13],[1,14,3,14],[1,4,1,7],[1,8,1,10],[1,11,3,11],[2,9,3,9]]}
[1,null,2,3,4,5,6,7,8,9,10,11,"11a","11b",12,13,14,15]
["Šifra inozemne pravne osobe",null,"ISIN","Početno stanje (isto kao stupac 11 prethodnog Q)","Promjene",null,null,null,"Prilagodbe",null,null,"Novo stanje - Ako ne postoji tržišna vrijednost, unosi se zbroj pozicija iz stupaca 11.a. i 11.b. (u tisućama eura)","Knjigovodstvena vrijednost dionica/udjela u kapitalu u vlasništvu izvještajnog subjekta (u tisućama eura)"," Knjigovodstveno stanje neraspodijeljene dobiti/gubitka koja na osnovi udjela u kapitalu pripada izvještajnom subjektu (u tisućama eura)","Stanje udjela u vlasništvu (%)","Naplaćena dividenda","Naplaćena ZD","Dobit/gubitak povezanih društava iz Šifrarnika B.B. (u tisućama eura)"]
[null,null,null,null,"Transakcija","Novoostvarena dobit/gubitak koja na osnovi udjela u vlasništvu pripada izvještajnom subjektu ","Potraživanja za izglasanu dividendu (koja pripada izvještajnom subjektu) ","Potraživanja za izglasanu isplatu zadržane dobiti (koja pripada izvještajnom subjektu)","Tečajna prilagodba","Cjenovna prilagodba","Prilagodba zbog reklasifikacije"]
["Vrsta inozemnog ulaganja","Broj inozemnog ulagača              "]
["<SifraInozemnePravneOsobe>","<BrojInozemnePravneOsobe>","<ISIN>","<PocetnoStanje>","<Transakcija>","<NoviDobitakGubitak","<IzglasanaDividenda>","<IzglasanaZadrzanaDobit>","<TecajnaPrilagodba>","<CjenovnaPrilagodba>","<PrilagodbaZbogReklasifikacije>","<NovoStanje>","<KnjigovodstvenaVrijednost>","<KnjigovodstvenoStanje>","<UdjeliUVlasnistvu>","<NaplacenaDividenda>","<NaplacenaZadrzanaDobit>"]

{"sheet":"Tablica B.1.OSTALA ULAGANJA","index":18,"n_rows":5,"n_cols":9,"rows_kept":5,"cut":false,"hidden":false,"merged":[[2,3,3,3],[2,4,3,4],[2,5,3,5],[2,6,3,6],[1,8,3,8],[1,4,1,6],[1,7,3,7],[1,2,3,2],[0,0,0,1],[1,0,1,1],[2,0,3,0],[2,1,3,1]]}
[1,null,2,3,4,5,6,7,8]
["Šifra inozemne pravne osobe - ostali ulagači (<10%)",null,"Početno stanje (isto kao stupac 10 prethodnog Q)","Promjena","Prilagodbe",null,null,"Novo stanje","Naplaćena dividenda"]
["Vrsta inozemnog ulaganja","Zemlja inozemnog ulagača",null,"Transakcija","Tečajna prilagodba","Cjenovna prilagodba","Prilagodba zbog reklasifikacije"]
[]
["<SifraInozemnePravneOsobe>","<ZemljaInozemnogUlagaca>","<PocetnoStanje>","<Transakcija>","<TecajnaPrilagodba>","<CjenovnaPrilagodba>","<PrilagodbaZbogReklasifikacije>","<NovoStanje>","<NaplacenaDividenda>"]

{"sheet":"B.2.1.Transakcije-izravna","index":19,"n_rows":3,"n_cols":6,"rows_kept":3,"cut":false,"hidden":false,"merged":[[0,3,1,3],[0,4,1,4],[0,5,1,5],[0,0,0,1],[0,2,1,2]]}
["Šifra inozemne pravne osobe",null,"Mjesec","Iznos","Način plaćanja","Ostvareni udio u vlasništvu (%)"]
["Vrsta inozemnog ulaganja","Broj inozemnog ulagača "]
["<SifraInozemnogUlagaca>","<BrojInozemnogUlagaca>","<Mjesec>","<Iznos>","<NacinPlacanja>","<OstvareniUdioUVlasnistvu>"]

{"sheet":"B.2.2.Transakcije-ostala","index":20,"n_rows":3,"n_cols":6,"rows_kept":3,"cut":false,"hidden":false,"merged":[[0,2,1,2],[0,3,1,3],[0,4,1,4],[0,5,1,5],[0,0,0,1]]}
["Šifra inozemne pravne osobe - ostali ulagači (<10%)",null,"Mjesec","Iznos","Način plaćanja","Ostvareni udio u vlasništvu (%)"]
["Vrsta inozemnog ulaganja*","Zemlja inozemne pravne osobe*"]
["<SIFRAINOZEMNEPRAVNEOSOBE>","<ZemljaInozemnePravneOsobe>","<Mjesec>","<Iznos>","<NacinPlacanja>","<OstvareniUdioUVlasnistvu>"]

{"sheet":"Tablica Dodatak A","index":21,"n_rows":2,"n_cols":11,"rows_kept":2,"cut":false,"hidden":false,"merged":[]}
["Poslovna Godina","Zemlja inozemne pravne osobe","Djelatnost (oznaka NACE)","Broj pravnih osoba ","Broj zaposlenih","Prodaja                      (u tisućama EUR)","Troškovi zaposlenika                 (u tisućama EUR)","Dodana vrijednost                  (u tisućama EUR)","Bruto investicije u materijalnu imovinu           (u tisućama EUR)","Izvoz proizvoda i usluga            (u tisućama EUR)","Uvoz proizvoda i usluga            (u tisućama EUR)"]
["<PoslovnaGodina>","<SifraZemlje>","<DjelatnostOznakaNACE>","<BrojPravnihOsoba>","<BrojZaposlenih>","<Prodaja>","<TroskoviZaposlenika>","<DodanaVrijednost>","<BrutoInvesticijeUMaterijalnuImovinu>","<IzvozProizvodaIUsluga>","<UvozProizvodaIUsluga>"]

{"sheet":"Kreiranje datoteke","index":22,"n_rows":38,"n_cols":8,"rows_kept":38,"cut":false,"hidden":false,"merged":[[8,4,8,5],[10,4,10,5],[6,4,6,5]]}
["UPUTA ZA DOSTAVU PODATAKA:"]
[]
["1. Omogućite izvođenje makro naredbi."]
[]
["2. Popunite tablice podacima."]
[]
["3. U narančasto polje upišite OIB:",null,null,null,null,null,null,"potvrdite unos tipkom <ENTER>"]
[]
["4. U žuto polje upišite godinu / odaberite razdoblje izvješća:"]
[]
{"$rows_left_out":28}